{"text_format":"1","workbook":"xlsx","n_sheets":3,"sheets":["Min.raumfläche nach Füllmenge","Max. Füllmenge pro Fläche","Basisdaten"],"not_rendered":{"charts":0,"images":3,"macros":1,"external_links":0,"defined_names":32,"comments":0,"pivot_tables":1},"unopened":[],"bounds":{"document_bytes":16777216,"sheet_cells":100000,"rows_first":2000,"rows_last":500,"rows_between":2000,"halvings":0,"cell_chars":16384,"cell_head_chars":4096},"cells_cut":0,"cells_raw":0,"read":"whole","date_system":"1900"}

{"sheet":"Min.raumfläche nach Füllmenge","index":0,"n_rows":31,"n_cols":15,"rows_kept":31,"cut":false,"hidden":false,"merged":[[11,11,14,12],[28,1,28,8],[7,2,7,5],[7,11,7,14],[30,1,32,8]]}
[]
[]
[]
[]
[null,"Berechnung von Mindestraumfläche bzw. max. Füllmenge für Panasonic R32-Split-Systeme in einem Personen-Aufenthaltsbereich nach DIN EN 378"]
[]
[]
[null,null,"Schritt 1: \nEingabe von Split-Modell und Einbausituation \n(Grüne Felder per Dropdown auswählen)",null,null,null,null,null,null,null,null,"Schritt 2: \nBerechnung der Mindest-Raumfläche (Amin) für die Aufstellung eines Geräts mit der in Schritt 1 berechneten Gesamt-Kältemittelfüllmenge des Systems\n(Orangefarbenes Feld ausfüllen)"]
[]
[null,null,"Modell:","CU-2Z35TBE",null,null,null,null,null,null,null,"Gesamtleitungslänge:",20,null,"m"]
[]
[null,null,"Vorgefüllt bis:",{"$f":"INDEX(TAB_Modelle,MATCH('Min.raumfläche nach Füllmenge'!D10,Modelle,0),3)","v":20},null,"m",null,null,null,null,null,{"$f":"IF(M10>INDEX(TAB_Modelle,MATCH('Min.raumfläche nach Füllmenge'!D10,Modelle,0),4),Meldung_2,IF(M10<D12,Meldung_3,\"\"))","v":""}]
[null,null,"Max. Leitungslänge ",{"$f":"INDEX(TAB_Modelle,MATCH('Min.raumfläche nach Füllmenge'!D10,Modelle,0),4)","v":30},null,"m"]
[null,null,"Füllmenge ab Werk:",{"$f":"INDEX(TAB_Modelle,MATCH('Min.raumfläche nach Füllmenge'!D10,Modelle,0),2)","v":1.1200000000000001},null,"kg"]
[]
[null,null,"Einbausituation des  Innengeräts:",{"$f":"IF(OR(INDEX(TAB_Modelle,MATCH('Min.raumfläche nach Füllmenge'!D10,Modelle,0),6)=\"Multi-2\",INDEX(TAB_Modelle,MATCH('Min.raumfläche nach Füllmenge'!D10,Modelle,0),6)=\"Multi>2\",INDEX(TAB_Modelle,MATCH('Min.raumfläche nach Füllmenge'!D10,Modelle,0),6)=\"PACi\"),\"Bitte wählen:\",Basisdaten!J9)","v":"Bitte wählen:"},null,"entspricht",null,{"$f":"IF(D16=\"Bitte wählen:\",INDEX(TAB_Einbauhöhe,MATCH(D17,Einbauhöhe,0),2),INDEX(TAB_Einbauhöhe,MATCH(D16,Einbauhöhe,0),2))","v":0.6}]
[null,null,null,"Bodenaufstellung"]
[]
[null,null,"Gesamt-Kältemittelfüllmenge (R32):",{"$f":"MAX(D14,mc)","v":1.1200000000000001},null,"kg",null,null,null,null,null,"Mindestraumfläche (Amin):",{"$f":"IF(D19<m_index_1_x_1_5,\"keine Beschränkung\",ROUND(POWER(D19/(2.5*POWER(LFL,5/4)*Einbauhöhe_ho),2),2))","v":"keine Beschränkung"},null,"m²"]
[]
[]
[null,"Die obige Berechnung basiert auf folgenden Voraussetzungen gemäß DIN EN378-1:2018-04:"]
[null,"- Toxizitätsklasse R32: A"]
[null,"- Brennbarkeitsklasse R32: 2L"]
[null,"- Das Innengerät ist in einem allgemeinen Zugangsbereich (a) montiert."]
[null,"- Aufstellungsort des Außengeräts: Klasse II - Verdichter im Maschinenraum oder im Freien"]
[null,"- Anlagenklassifikation: direkt freisetzende Anlage"]
[]
[null,"Hinweis:\nIst die vorhandene Raumfläche kleiner als die berechnete Mindestraumfläche (Amin), können Sie anhand DIN EN 378-1, C.3 überprüfen, welche zusätzlichen Maßnahmen wie zusätzliche Belüftung, Absaugung des ausgetretenen Kältemittels usw. getroffen werden können um eine kleinere Raumfläche zu ermöglichen."]
[]
{"$rows_left_out":2}
{"sheet":"Max. Füllmenge pro Fläche","index":1,"n_rows":37,"n_cols":14,"rows_kept":37,"cut":false,"hidden":false,"merged":[[4,11,5,12],[7,2,8,5],[12,2,13,2],[29,1,32,8],[4,1,4,6],[7,8,19,9]]}
[]
[]
[]
[]
[null,"Berechnung der max. zulässigen Füllmenge an R32 in Abhängigkeit von der verfügbaren Raumfläche",null,null,null,null,null,null,null,null,null,"Modelle, deren Werksfüllung bei entsprechender Einbausituation unter der im linken Kasten berechneten max. Füllmenge liegt."]
[]
[]
[null,null,"Orangefarbenes Feld ausfüllen und Einbausituation des Innengeräts per Drop-Down auswählen:",null,null,null,null,null,{"$f":"IF(ROUND(2.5*POWER(LFL,5/4)*Einbauhöhe_ho_2*POWER(Fläche_A_2,1/2),2) > m_index_2_x_1_5,Meldung_1,\"\")","v":""},null,null,null,null,2.5500000000000003]
[null,null,null,null,null,null,null,null,null,null,null,null,null,2.5]
[null,null,null,null,null,null,null,null,null,null,null,null,null,2.31]
[null,null,"Fläche des Raums:",20,null,"m²",null,null,null,null,null,null,null,2.31]
[null,null,null,null,null,null,null,null,null,null,null,null,null,2.31]
[null,null,"Einbausituation des \nInnengeräts (Drop-Down):",null,null,null,null,null,null,null,null,null,null,2.3000000000000003]
[null,null,null,"Wandmontage",null,null,null,null,null,null,null,null,null,2.2800000000000002]
[null,null,null,null,null,null,null,null,null,null,null,null,null,2.2800000000000002]
[null,null,"entspricht einer Einbauhöhe von:",{"$f":"IF(D14=\"Bitte wählen:\",INDEX(TAB_Einbauhöhe,MATCH(C25,Einbauhöhe,0),2),INDEX(TAB_Einbauhöhe,MATCH(D14,Einbauhöhe,0),2))","v":1.8},null,"m",null,null,null,null,null,null,null,1.9800000000000002]
[null,null,null,null,null,null,null,null,null,null,null,null,null,1.9800000000000002]
[null,null,null,null,null,null,null,null,null,null,null,null,null,1.9800000000000002]
[null,null,"Max. Füllmenge R32:",{"$f":"IF(ROUND(2.5*POWER(LFL,5/4)*Einbauhöhe_ho_2*POWER(Fläche_A_2,1/2),2)<m_index_2_x_1_5,IF(ROUND(2.5*POWER(LFL,5/4)*Einbauhöhe_ho_2*POWER(Fläche_A_2,1/2),2)>m_index_1_x_1_5,ROUND(2.5*POWER(LFL,5/4)*Einbauhöhe_ho_2*POWER(Fläche_A_2,1/2),2),m_index_1_x_1_5),m_index_2_x_1_5)","v":4.5999999999999996},null,"kg",null,null,null,null,null,null,null,1.4800000000000002]
[null,null,null,null,null,null,null,null,null,null,null,null,null,1.4800000000000002]
[null,null,null,null,null,null,null,null,null,null,null,null,null,1.33]
[null,"Die obige Berechnung basiert auf folgenden Voraussetzungen gemäß DIN EN378-1:2018-04:",null,null,null,null,null,null,null,null,null,null,null,1.33]
[null,"- Toxizitätsklasse R32: A",null,null,null,null,null,null,null,null,null,null,null,1.33]
[null,"- Brennbarkeitsklasse R32: 2L",null,null,null,null,null,null,null,null,null,null,null,0.83000000000000007]
[null,"- Das Innengerät ist in einem allgemeinen Zugangsbereich (a) montiert.",null,null,null,null,null,null,null,null,null,null,null,0.83000000000000007]
[null,"- Aufstellungsort des Außengeräts: Klasse II - Verdichter im Maschinenraum oder im Freien",null,null,null,null,null,null,null,null,null,null,null,0.71]
[null,"- Anlagenklassifikation: direkt freisetzende Anlage",null,null,null,null,null,null,null,null,null,null,null,0.71]
[null,null,null,null,null,null,null,null,null,null,null,null,null,0.45000000000000018]
[null,null,null,null,null,null,null,null,null,null,null,null,null,0.45000000000000018]
[null,"© Panasonic 2018\nIrrtümer und Änderungen bleiben vorbehalten. Sämtliche Angaben und Berechnungen ohne Gewähr. Bitte beachten Sie die Dokumentation der jeweils auswählbaren Gerätemodelle.",null,null,null,null,null,null,null,null,null,null,null,0.45000000000000018]
{"$rows_left_out":8}
{"sheet":"Basisdaten","index":2,"n_rows":86,"n_cols":16,"rows_kept":86,"cut":false,"hidden":true,"merged":[[21,10,30,18],[32,10,33,18],[35,10,36,18]]}
["Modell","Kältemittelfüllung ab Werk (kg)","Vorgefüllte Länge (m)","Max. Gesamtlänge (m)","Zus. Füllmenge pro m (kg)","Gerätetyp","Differenz","Typ",null,"Gerätetyp","Einbauhöhe (m)"]
["CU-2Z35TBE",1.1200000000000001,20,30,1.4999999999999999E-2,"Multi-2",{"$f":"Max._Füllmenge-Tabelle1[[#This Row],[Kältemittelfüllung ab Werk (kg)]]","v":3.4799999999999995},{"$f":" IF(OR(OR(Tabelle1[[#This Row],[Gerätetyp]]= \"Multi-2\", Tabelle1[[#This Row],[Gerätetyp]]=\"Multi>2\", Tabelle1[[#This Row],[Gerätetyp]]=$J$11),AND(Tabelle1[[#This Row],[Gerätetyp]]=\"PACi\",$J$11<>\"Bodenaufstellung\")),1,0)","v":1},null,"Deckeneinbau",2.2000000000000002,null,"LFL R32",0.307,"kg/m³"]
["CU-2Z41TBE",1.1200000000000001,20,30,1.4999999999999999E-2,"Multi-2",{"$f":"Max._Füllmenge-Tabelle1[[#This Row],[Kältemittelfüllung ab Werk (kg)]]","v":3.4799999999999995},{"$f":" IF(OR(OR(Tabelle1[[#This Row],[Gerätetyp]]= \"Multi-2\", Tabelle1[[#This Row],[Gerätetyp]]=\"Multi>2\", Tabelle1[[#This Row],[Gerätetyp]]=$J$11),AND(Tabelle1[[#This Row],[Gerätetyp]]=\"PACi\",$J$11<>\"Bodenaufstellung\")),1,0)","v":1},null,"Wandmontage",1.8,null,"mc",{"$f":"INDEX(TAB_Modelle,MATCH('Min.raumfläche nach Füllmenge'!D10,Modelle,0),2) + ('Min.raumfläche nach Füllmenge'!M10-INDEX(TAB_Modelle,MATCH('Min.raumfläche nach Füllmenge'!D10,Modelle,0),3))*INDEX(TAB_Modelle,MATCH('Min.raumfläche nach Füllmenge'!D10,Modelle,0),5)","v":1.1200000000000001},"kg"]
["CU-2Z50TBE",1.1200000000000001,20,30,1.4999999999999999E-2,"Multi-2",{"$f":"Max._Füllmenge-Tabelle1[[#This Row],[Kältemittelfüllung ab Werk (kg)]]","v":3.4799999999999995},{"$f":" IF(OR(OR(Tabelle1[[#This Row],[Gerätetyp]]= \"Multi-2\", Tabelle1[[#This Row],[Gerätetyp]]=\"Multi>2\", Tabelle1[[#This Row],[Gerätetyp]]=$J$11),AND(Tabelle1[[#This Row],[Gerätetyp]]=\"PACi\",$J$11<>\"Bodenaufstellung\")),1,0)","v":1},null,"Bodenaufstellung",0.6,null,"m1 = 4 m³ x LFL:",{"$f":" LFL * 4","v":1.228},"kg"]
["CU-3Z52TBE",2.1,30,50,0.02,"Multi>2",{"$f":"Max._Füllmenge-Tabelle1[[#This Row],[Kältemittelfüllung ab Werk (kg)]]","v":2.4999999999999996},{"$f":" IF(OR(OR(Tabelle1[[#This Row],[Gerätetyp]]= \"Multi-2\", Tabelle1[[#This Row],[Gerätetyp]]=\"Multi>2\", Tabelle1[[#This Row],[Gerätetyp]]=$J$11),AND(Tabelle1[[#This Row],[Gerätetyp]]=\"PACi\",$J$11<>\"Bodenaufstellung\")),1,0)","v":1},null,null,null,null,"m1 x 1,5 =",{"$f":"1.5*m_index_1","v":1.8420000000000001},"kg"]
["CU-3Z68TBE",2.1,30,60,0.02,"Multi>2",{"$f":"Max._Füllmenge-Tabelle1[[#This Row],[Kältemittelfüllung ab Werk (kg)]]","v":2.4999999999999996},{"$f":" IF(OR(OR(Tabelle1[[#This Row],[Gerätetyp]]= \"Multi-2\", Tabelle1[[#This Row],[Gerätetyp]]=\"Multi>2\", Tabelle1[[#This Row],[Gerätetyp]]=$J$11),AND(Tabelle1[[#This Row],[Gerätetyp]]=\"PACi\",$J$11<>\"Bodenaufstellung\")),1,0)","v":1},null,null,null,null,"m2 = 26 m³ x LFL:",{"$f":"26*LFL","v":7.9820000000000002},"kg"]
["CU-4Z68TBE",2.1,30,60,0.02,"Multi>2",{"$f":"Max._Füllmenge-Tabelle1[[#This Row],[Kältemittelfüllung ab Werk (kg)]]","v":2.4999999999999996},{"$f":" IF(OR(OR(Tabelle1[[#This Row],[Gerätetyp]]= \"Multi-2\", Tabelle1[[#This Row],[Gerätetyp]]=\"Multi>2\", Tabelle1[[#This Row],[Gerätetyp]]=$J$11),AND(Tabelle1[[#This Row],[Gerätetyp]]=\"PACi\",$J$11<>\"Bodenaufstellung\")),1,0)","v":1},null,null,null,null,"m2 x 1,5 =",{"$f":"1.5*m_index_2","v":11.973000000000001},"kg","= Max. zulässige Kältemittelfüllmenge (ohne zus. Maßnahmen)"]
["CU-4Z80TBE",2.72,45,70,0.02,"Multi>2",{"$f":"Max._Füllmenge-Tabelle1[[#This Row],[Kältemittelfüllung ab Werk (kg)]]","v":1.8799999999999994},{"$f":" IF(OR(OR(Tabelle1[[#This Row],[Gerätetyp]]= \"Multi-2\", Tabelle1[[#This Row],[Gerätetyp]]=\"Multi>2\", Tabelle1[[#This Row],[Gerätetyp]]=$J$11),AND(Tabelle1[[#This Row],[Gerätetyp]]=\"PACi\",$J$11<>\"Bodenaufstellung\")),1,0)","v":1}]
["CU-5Z90TBE",2.72,45,80,0.02,"Multi>2",{"$f":"Max._Füllmenge-Tabelle1[[#This Row],[Kältemittelfüllung ab Werk (kg)]]","v":1.8799999999999994},{"$f":" IF(OR(OR(Tabelle1[[#This Row],[Gerätetyp]]= \"Multi-2\", Tabelle1[[#This Row],[Gerätetyp]]=\"Multi>2\", Tabelle1[[#This Row],[Gerätetyp]]=$J$11),AND(Tabelle1[[#This Row],[Gerätetyp]]=\"PACi\",$J$11<>\"Bodenaufstellung\")),1,0)","v":1},null,{"$f":"INDEX(TAB_Modelle,MATCH('Min.raumfläche nach Füllmenge'!D10,Modelle,0),6)","v":"Multi-2"}]
["CS-TZ20TKEW-1 / CU-TZ20TKE-1",0.61,7.5,15,0.01,"Wandmontage",{"$f":"Max._Füllmenge-Tabelle1[[#This Row],[Kältemittelfüllung ab Werk (kg)]]","v":3.9899999999999998},{"$f":" IF(OR(OR(Tabelle1[[#This Row],[Gerätetyp]]= \"Multi-2\", Tabelle1[[#This Row],[Gerätetyp]]=\"Multi>2\", Tabelle1[[#This Row],[Gerätetyp]]=$J$11),AND(Tabelle1[[#This Row],[Gerätetyp]]=\"PACi\",$J$11<>\"Bodenaufstellung\")),1,0)","v":1}]
["CS-TZ25TKEW-1 / CU-TZ25TKE-1",0.7,7.5,15,0.01,"Wandmontage",{"$f":"Max._Füllmenge-Tabelle1[[#This Row],[Kältemittelfüllung ab Werk (kg)]]","v":3.8999999999999995},{"$f":" IF(OR(OR(Tabelle1[[#This Row],[Gerätetyp]]= \"Multi-2\", Tabelle1[[#This Row],[Gerätetyp]]=\"Multi>2\", Tabelle1[[#This Row],[Gerätetyp]]=$J$11),AND(Tabelle1[[#This Row],[Gerätetyp]]=\"PACi\",$J$11<>\"Bodenaufstellung\")),1,0)","v":1},null,{"$f":"'Max. Füllmenge pro Fläche'!D14","v":"Wandmontage"}]
["CS-TZ35TKEW-1 / CU-TZ35TKE-1",0.82,7.5,15,0.01,"Wandmontage",{"$f":"Max._Füllmenge-Tabelle1[[#This Row],[Kältemittelfüllung ab Werk (kg)]]","v":3.78},{"$f":" IF(OR(OR(Tabelle1[[#This Row],[Gerätetyp]]= \"Multi-2\", Tabelle1[[#This Row],[Gerätetyp]]=\"Multi>2\", Tabelle1[[#This Row],[Gerätetyp]]=$J$11),AND(Tabelle1[[#This Row],[Gerätetyp]]=\"PACi\",$J$11<>\"Bodenaufstellung\")),1,0)","v":1}]
["CS-TZ42TKEW-1 / CU-TZ42TKE-1",0.87,7.5,15,0.01,"Wandmontage",{"$f":"Max._Füllmenge-Tabelle1[[#This Row],[Kältemittelfüllung ab Werk (kg)]]","v":3.7299999999999995},{"$f":" IF(OR(OR(Tabelle1[[#This Row],[Gerätetyp]]= \"Multi-2\", Tabelle1[[#This Row],[Gerätetyp]]=\"Multi>2\", Tabelle1[[#This Row],[Gerätetyp]]=$J$11),AND(Tabelle1[[#This Row],[Gerätetyp]]=\"PACi\",$J$11<>\"Bodenaufstellung\")),1,0)","v":1}]
["CS-TZ50TKEW / CU-TZ50TKE",1.1399999999999999,7.5,20,1.4999999999999999E-2,"Wandmontage",{"$f":"Max._Füllmenge-Tabelle1[[#This Row],[Kältemittelfüllung ab Werk (kg)]]","v":3.46},{"$f":" IF(OR(OR(Tabelle1[[#This Row],[Gerätetyp]]= \"Multi-2\", Tabelle1[[#This Row],[Gerätetyp]]=\"Multi>2\", Tabelle1[[#This Row],[Gerätetyp]]=$J$11),AND(Tabelle1[[#This Row],[Gerätetyp]]=\"PACi\",$J$11<>\"Bodenaufstellung\")),1,0)","v":1}]
["CS-TZ60TKEW / CU-TZ60TKE",1.1100000000000001,7.5,30,1.4999999999999999E-2,"Wandmontage",{"$f":"Max._Füllmenge-Tabelle1[[#This Row],[Kältemittelfüllung ab Werk (kg)]]","v":3.4899999999999993},{"$f":" IF(OR(OR(Tabelle1[[#This Row],[Gerätetyp]]= \"Multi-2\", Tabelle1[[#This Row],[Gerätetyp]]=\"Multi>2\", Tabelle1[[#This Row],[Gerätetyp]]=$J$11),AND(Tabelle1[[#This Row],[Gerätetyp]]=\"PACi\",$J$11<>\"Bodenaufstellung\")),1,0)","v":1}]
["CS-TZ71TKEW / CU-TZ71TKE",1.32,10,30,2.5000000000000001E-2,"Wandmontage",{"$f":"Max._Füllmenge-Tabelle1[[#This Row],[Kältemittelfüllung ab Werk (kg)]]","v":3.2799999999999994},{"$f":" IF(OR(OR(Tabelle1[[#This Row],[Gerätetyp]]= \"Multi-2\", Tabelle1[[#This Row],[Gerätetyp]]=\"Multi>2\", Tabelle1[[#This Row],[Gerätetyp]]=$J$11),AND(Tabelle1[[#This Row],[Gerätetyp]]=\"PACi\",$J$11<>\"Bodenaufstellung\")),1,0)","v":1}]
["CS-Z20TKEW / CU-Z20TKE",0.76,7.5,15,0.01,"Wandmontage",{"$f":"Max._Füllmenge-Tabelle1[[#This Row],[Kältemittelfüllung ab Werk (kg)]]","v":3.84},{"$f":" IF(OR(OR(Tabelle1[[#This Row],[Gerätetyp]]= \"Multi-2\", Tabelle1[[#This Row],[Gerätetyp]]=\"Multi>2\", Tabelle1[[#This Row],[Gerätetyp]]=$J$11),AND(Tabelle1[[#This Row],[Gerätetyp]]=\"PACi\",$J$11<>\"Bodenaufstellung\")),1,0)","v":1}]
["CS-Z25TKEW / CU-Z25TKE",0.85,7.5,15,0.01,"Wandmontage",{"$f":"Max._Füllmenge-Tabelle1[[#This Row],[Kältemittelfüllung ab Werk (kg)]]","v":3.7499999999999996},{"$f":" IF(OR(OR(Tabelle1[[#This Row],[Gerätetyp]]= \"Multi-2\", Tabelle1[[#This Row],[Gerätetyp]]=\"Multi>2\", Tabelle1[[#This Row],[Gerätetyp]]=$J$11),AND(Tabelle1[[#This Row],[Gerätetyp]]=\"PACi\",$J$11<>\"Bodenaufstellung\")),1,0)","v":1}]
["CS-Z35TKEW / CU-Z35TKE",0.91,7.5,15,0.01,"Wandmontage",{"$f":"Max._Füllmenge-Tabelle1[[#This Row],[Kältemittelfüllung ab Werk (kg)]]","v":3.6899999999999995},{"$f":" IF(OR(OR(Tabelle1[[#This Row],[Gerätetyp]]= \"Multi-2\", Tabelle1[[#This Row],[Gerätetyp]]=\"Multi>2\", Tabelle1[[#This Row],[Gerätetyp]]=$J$11),AND(Tabelle1[[#This Row],[Gerätetyp]]=\"PACi\",$J$11<>\"Bodenaufstellung\")),1,0)","v":1}]
["CS-Z42TKEW / CU-Z42TKE",0.87,7.5,15,0.01,"Wandmontage",{"$f":"Max._Füllmenge-Tabelle1[[#This Row],[Kältemittelfüllung ab Werk (kg)]]","v":3.7299999999999995},{"$f":" IF(OR(OR(Tabelle1[[#This Row],[Gerätetyp]]= \"Multi-2\", Tabelle1[[#This Row],[Gerätetyp]]=\"Multi>2\", Tabelle1[[#This Row],[Gerätetyp]]=$J$11),AND(Tabelle1[[#This Row],[Gerätetyp]]=\"PACi\",$J$11<>\"Bodenaufstellung\")),1,0)","v":1}]
["CS-Z50TKEW / CU-Z50TKE",1.1100000000000001,7.5,20,1.4999999999999999E-2,"Wandmontage",{"$f":"Max._Füllmenge-Tabelle1[[#This Row],[Kältemittelfüllung ab Werk (kg)]]","v":3.4899999999999993},{"$f":" IF(OR(OR(Tabelle1[[#This Row],[Gerätetyp]]= \"Multi-2\", Tabelle1[[#This Row],[Gerätetyp]]=\"Multi>2\", Tabelle1[[#This Row],[Gerätetyp]]=$J$11),AND(Tabelle1[[#This Row],[Gerätetyp]]=\"PACi\",$J$11<>\"Bodenaufstellung\")),1,0)","v":1}]
["CS-Z71TKEW / CU-Z71TKE",1.37,10,30,2.5000000000000001E-2,"Wandmontage",{"$f":"Max._Füllmenge-Tabelle1[[#This Row],[Kältemittelfüllung ab Werk (kg)]]","v":3.2299999999999995},{"$f":" IF(OR(OR(Tabelle1[[#This Row],[Gerätetyp]]= \"Multi-2\", Tabelle1[[#This Row],[Gerätetyp]]=\"Multi>2\", Tabelle1[[#This Row],[Gerätetyp]]=$J$11),AND(Tabelle1[[#This Row],[Gerätetyp]]=\"PACi\",$J$11<>\"Bodenaufstellung\")),1,0)","v":1},null,"Meldung 1:","Achtung: \nDie berechnete Füllmenge ist größer als 11,973 kg und überschreitet damit die maximal zulässige Kältemittel-Füllmenge gemäß DIN EN 378-1, welche keine Zusatzmaßnahmen erfordert. Überprüfen Sie anhand DIN EN 378-1, C.3, welche zusätzlichen Maßnahmen wie zusätzliche Belüftung, Absaugung des ausgetretenen Kältemittels usw. getroffen werden müssen, um eine höhere Kältemittel-Füllmenge zu ermöglichen."]
["CS-Z20VKEW / CU-Z20VKE",0.7,7.5,15,0.01,"Wandmontage",{"$f":"Max._Füllmenge-Tabelle1[[#This Row],[Kältemittelfüllung ab Werk (kg)]]","v":3.8999999999999995},{"$f":" IF(OR(OR(Tabelle1[[#This Row],[Gerätetyp]]= \"Multi-2\", Tabelle1[[#This Row],[Gerätetyp]]=\"Multi>2\", Tabelle1[[#This Row],[Gerätetyp]]=$J$11),AND(Tabelle1[[#This Row],[Gerätetyp]]=\"PACi\",$J$11<>\"Bodenaufstellung\")),1,0)","v":1}]
["CS-Z25VKEW / CU-Z25VKE",0.85,7.5,15,0.01,"Wandmontage",{"$f":"Max._Füllmenge-Tabelle1[[#This Row],[Kältemittelfüllung ab Werk (kg)]]","v":3.7499999999999996},{"$f":" IF(OR(OR(Tabelle1[[#This Row],[Gerätetyp]]= \"Multi-2\", Tabelle1[[#This Row],[Gerätetyp]]=\"Multi>2\", Tabelle1[[#This Row],[Gerätetyp]]=$J$11),AND(Tabelle1[[#This Row],[Gerätetyp]]=\"PACi\",$J$11<>\"Bodenaufstellung\")),1,0)","v":1}]
["CS-Z35VKEW / CU-Z35VKE",0.85,7.5,15,0.01,"Wandmontage",{"$f":"Max._Füllmenge-Tabelle1[[#This Row],[Kältemittelfüllung ab Werk (kg)]]","v":3.7499999999999996},{"$f":" IF(OR(OR(Tabelle1[[#This Row],[Gerätetyp]]= \"Multi-2\", Tabelle1[[#This Row],[Gerätetyp]]=\"Multi>2\", Tabelle1[[#This Row],[Gerätetyp]]=$J$11),AND(Tabelle1[[#This Row],[Gerätetyp]]=\"PACi\",$J$11<>\"Bodenaufstellung\")),1,0)","v":1}]
["CS-Z42VKEW / CU-Z42VKE",0.89,7.5,15,0.01,"Wandmontage",{"$f":"Max._Füllmenge-Tabelle1[[#This Row],[Kältemittelfüllung ab Werk (kg)]]","v":3.7099999999999995},{"$f":" IF(OR(OR(Tabelle1[[#This Row],[Gerätetyp]]= \"Multi-2\", Tabelle1[[#This Row],[Gerätetyp]]=\"Multi>2\", Tabelle1[[#This Row],[Gerätetyp]]=$J$11),AND(Tabelle1[[#This Row],[Gerätetyp]]=\"PACi\",$J$11<>\"Bodenaufstellung\")),1,0)","v":1}]
["CS-Z50VKEW / CU-Z50VKE",1.1499999999999999,7.5,30,1.4999999999999999E-2,"Wandmontage",{"$f":"Max._Füllmenge-Tabelle1[[#This Row],[Kältemittelfüllung ab Werk (kg)]]","v":3.4499999999999997},{"$f":" IF(OR(OR(Tabelle1[[#This Row],[Gerätetyp]]= \"Multi-2\", Tabelle1[[#This Row],[Gerätetyp]]=\"Multi>2\", Tabelle1[[#This Row],[Gerätetyp]]=$J$11),AND(Tabelle1[[#This Row],[Gerätetyp]]=\"PACi\",$J$11<>\"Bodenaufstellung\")),1,0)","v":1}]
["CS-Z25UB4EAW / CU-Z25UBEA",0.88,7.5,20,0.01,"Deckeneinbau",{"$f":"Max._Füllmenge-Tabelle1[[#This Row],[Kältemittelfüllung ab Werk (kg)]]","v":3.7199999999999998},{"$f":" IF(OR(OR(Tabelle1[[#This Row],[Gerätetyp]]= \"Multi-2\", Tabelle1[[#This Row],[Gerätetyp]]=\"Multi>2\", Tabelle1[[#This Row],[Gerätetyp]]=$J$11),AND(Tabelle1[[#This Row],[Gerätetyp]]=\"PACi\",$J$11<>\"Bodenaufstellung\")),1,0)","v":0}]
["CS-Z35UB4EAW / CU-Z35UBEA",0.93,7.5,20,0.01,"Deckeneinbau",{"$f":"Max._Füllmenge-Tabelle1[[#This Row],[Kältemittelfüllung ab Werk (kg)]]","v":3.6699999999999995},{"$f":" IF(OR(OR(Tabelle1[[#This Row],[Gerätetyp]]= \"Multi-2\", Tabelle1[[#This Row],[Gerätetyp]]=\"Multi>2\", Tabelle1[[#This Row],[Gerätetyp]]=$J$11),AND(Tabelle1[[#This Row],[Gerätetyp]]=\"PACi\",$J$11<>\"Bodenaufstellung\")),1,0)","v":0}]
["CS-Z50UB4EAW / CU-Z50UBEA",1.1299999999999999,7.5,30,1.4999999999999999E-2,"Deckeneinbau",{"$f":"Max._Füllmenge-Tabelle1[[#This Row],[Kältemittelfüllung ab Werk (kg)]]","v":3.4699999999999998},{"$f":" IF(OR(OR(Tabelle1[[#This Row],[Gerätetyp]]= \"Multi-2\", Tabelle1[[#This Row],[Gerätetyp]]=\"Multi>2\", Tabelle1[[#This Row],[Gerätetyp]]=$J$11),AND(Tabelle1[[#This Row],[Gerätetyp]]=\"PACi\",$J$11<>\"Bodenaufstellung\")),1,0)","v":0}]
{"$rows_left_out":56}